{"text_format":"1","workbook":"xlsx","n_sheets":8,"sheets":["Explanation","Inputs","Modules","Templates","Changes July 2023","Changes October 2025","Versioning information","Glossary"],"not_rendered":{"charts":0,"images":1,"macros":0,"external_links":0,"defined_names":64,"comments":0,"pivot_tables":0},"unopened":[],"bounds":{"document_bytes":16777216,"sheet_cells":100000,"rows_first":2000,"rows_last":500,"rows_between":2000,"halvings":0,"cell_chars":16384,"cell_head_chars":4096},"cells_cut":0,"cells_raw":0,"read":"whole","date_system":"1900"}

{"sheet":"Explanation","index":0,"n_rows":41,"n_cols":5,"rows_kept":41,"cut":false,"hidden":false,"merged":[[0,1,1,4],[27,1,27,4],[28,1,28,4],[30,1,30,2],[7,1,7,4],[3,1,3,4],[20,1,20,4],[25,1,25,4],[14,1,14,4],[9,1,9,4],[15,1,15,4],[21,1,21,4],[22,2,22,4],[4,3,4,4],[5,3,5,4],[8,1,8,4],[40,1,40,2],[37,3,37,4],[38,3,38,4],[39,3,39,4],[40,3,40,4],[35,1,35,4],[37,1,37,2],[38,1,38,2],[39,1,39,2],[32,1,32,2],[23,2,23,4],[30,3,30,4],[31,3,31,4],[32,3,32,4],[34,1,34,4],[31,1,31,2]]}
[null,"Reporting requirements applicable in accordance with version 4.0 of the EBA reporting framework"]
[]
[]
[null,"(Main) addressee of the tool"]
[null,"-","Credit institutions","as defined in Article 4(1), point (1), of Regulation (EU) No 575/2013 (CRR)"]
[null,"-","Investment firms applying the CRR","by request of their competent authority (Article 5 of Directive (EU) 2019/2034 - IFD)"]
[]
[null,"Scope"]
{"$rows_left_out":34}
{"sheet":"Inputs","index":1,"n_rows":58,"n_cols":31,"rows_kept":58,"cut":false,"hidden":false,"merged":[]}
["Attribute category","Attribute","Code","Value","Value code","Legal reference","Explanations\nPlease note that the statements in this column are simplifying reflections on the regulatory rules, that aim to help you to understand quickly what the content of the relevant attribute is, and aim to help you to identify possible proxies, if you do not know the exact value by heart."]
["GENERAL INFORMATION","Level of application of the reporting requirements","TYPE","Consolidated reporting by an EU parent credit institution",{"$f":"OFFSET($T2, 0, MATCH($D2, $H2:$S2, 0)-1)","v":"CONS_EU"},"Points (28), (29), (29c) and (29d) of Article 4(1) CRR; Articles 6, 11, 22 CRR.",null,"Consolidated reporting by an EU parent credit institution","Consolidated reporting by a parent credit institution in a Member State","Other consolidated reporting by a credit institution","Individual reporting by a credit institution belonging to a group","Individual reporting by a credit institution not belonging to a group (standalone institution)",null,null,null,null,null,null,null,"CONS_EU","CONS_MS","CONS_OT","SOLO_SUB","SOLO_SA"]
["GENERAL INFORMATION","Accounting framework for reporting purposes","ACCOUNTING_FRAMEWORK","National GAAP IFRS-compatible",{"$f":"OFFSET($T3, 0, MATCH($D3, $H3:$J3, 0)-1)","v":"GAAP_IFRS"},"Articles 24, 430(4) CRR; Annex V, Part 1, para. 2 of Regulation (EU) 2024/3117.",null,"IFRS","National GAAP IFRS-compatible","National GAAP non-IFRS compatible",null,null,null,null,null,null,null,null,null,"IFRS","GAAP_IFRS","GAAP_NO_IFRS"]
["GENERAL INFORMATION","Accounting year-end","YEAR_END","December",{"$f":"OFFSET($T4, 0, MATCH($D4, $H4:$S4, 0)-1)","v":12},"Article 2(3) of Regulation (EU) 2024/3117.",null,"January","February","March","April","May","June","July","August","September","October","November","December",1,2,3,4,5,6,7,8,9,10,11,12]
["GENERAL INFORMATION","Size and complexity class","SNCI","Small",{"$f":"OFFSET($T5, 0, MATCH($D5, $H5:$S5, 0)-1)","v":"SMALL"},"Points (145) and (146) of Article 4(1) CRR.",null,"Small","Regular","Large",null,null,null,null,null,null,null,null,null,"SMALL","REGULAR","LARGE"]
["GENERAL INFORMATION","Is a G-SII","GSII","Yes",{"$f":"OFFSET($T6, 0, MATCH($D6, $H6:$S6, 0)-1)","v":"Y"},"Points (133), (134) and (136) of Article 4(1) CRR.",null,"Yes","No",null,null,null,null,null,null,null,null,null,null,"Y","N"]
["GENERAL INFORMATION","Listed in a regulated market","LISTED","Yes",{"$f":"OFFSET($T7, 0, MATCH($D7, $H7:$S7, 0)-1)","v":"Y"},"Point (148) of Article 4(1) CRR.",null,"Yes","No",null,null,null,null,null,null,null,null,null,null,"Y","N"]
["CREDIT AND COUNTERPARTY CREDIT RISK - PRUDENTIAL INFORMATION","Credit risk approach:\nStandardised Approach (SA)","CREDRISK_SA","No",{"$f":"OFFSET($T8, 0, MATCH($D8, $H8:$S8, 0)-1)","v":"N"},"Articles 107, 150 CRR.",null,"Yes","No",null,null,null,null,null,null,null,null,null,null,"Y","N"]
{"$rows_left_out":51}
{"sheet":"Modules","index":2,"n_rows":17,"n_cols":16,"rows_kept":17,"cut":false,"hidden":false,"merged":[[0,3,0,14]]}
[null,null,null,"Reporting obligations"]
["Module","Applicable framework","Reporting criteria","Jan","Feb","Mar","Apr","May","Jun","Jul","Aug","Sep","Oct","Nov","Dec","Additional information"]
["COREP_OF","COREP_4.0","IF(MOD(CALENDAR_MONTH, 3)=0, \"MANDATORY\", \"-\")",{"$f":"IF(MOD(CALENDAR_MONTH, 3)=0, \"MANDATORY\", \"-\")","v":"-"},{"$f":"IF(MOD(CALENDAR_MONTH, 3)=0, \"MANDATORY\", \"-\")","v":"-"},{"$f":"IF(MOD(CALENDAR_MONTH, 3)=0, \"MANDATORY\", \"-\")","v":"MANDATORY"},{"$f":"IF(MOD(CALENDAR_MONTH, 3)=0, \"MANDATORY\", \"-\")","v":"-"},{"$f":"IF(MOD(CALENDAR_MONTH, 3)=0, \"MANDATORY\", \"-\")","v":"-"},{"$f":"IF(MOD(CALENDAR_MONTH, 3)=0, \"MANDATORY\", \"-\")","v":"MANDATORY"},{"$f":"IF(MOD(CALENDAR_MONTH, 3)=0, \"MANDATORY\", \"-\")","v":"-"},{"$f":"IF(MOD(CALENDAR_MONTH, 3)=0, \"MANDATORY\", \"-\")","v":"-"},{"$f":"IF(MOD(CALENDAR_MONTH, 3)=0, \"MANDATORY\", \"-\")","v":"MANDATORY"},{"$f":"IF(MOD(CALENDAR_MONTH, 3)=0, \"MANDATORY\", \"-\")","v":"-"},{"$f":"IF(MOD(CALENDAR_MONTH, 3)=0, \"MANDATORY\", \"-\")","v":"-"},{"$f":"IF(MOD(CALENDAR_MONTH, 3)=0, \"MANDATORY\", \"-\")","v":"MANDATORY"}]
["COREP_LE","COREP_3.2","IF(MOD(CALENDAR_MONTH, 3)=0, \"MANDATORY\", \"-\")",{"$f":"IF(MOD(CALENDAR_MONTH, 3)=0, \"MANDATORY\", \"-\")","v":"-"},{"$f":"IF(MOD(CALENDAR_MONTH, 3)=0, \"MANDATORY\", \"-\")","v":"-"},{"$f":"IF(MOD(CALENDAR_MONTH, 3)=0, \"MANDATORY\", \"-\")","v":"MANDATORY"},{"$f":"IF(MOD(CALENDAR_MONTH, 3)=0, \"MANDATORY\", \"-\")","v":"-"},{"$f":"IF(MOD(CALENDAR_MONTH, 3)=0, \"MANDATORY\", \"-\")","v":"-"},{"$f":"IF(MOD(CALENDAR_MONTH, 3)=0, \"MANDATORY\", \"-\")","v":"MANDATORY"},{"$f":"IF(MOD(CALENDAR_MONTH, 3)=0, \"MANDATORY\", \"-\")","v":"-"},{"$f":"IF(MOD(CALENDAR_MONTH, 3)=0, \"MANDATORY\", \"-\")","v":"-"},{"$f":"IF(MOD(CALENDAR_MONTH, 3)=0, \"MANDATORY\", \"-\")","v":"MANDATORY"},{"$f":"IF(MOD(CALENDAR_MONTH, 3)=0, \"MANDATORY\", \"-\")","v":"-"},{"$f":"IF(MOD(CALENDAR_MONTH, 3)=0, \"MANDATORY\", \"-\")","v":"-"},{"$f":"IF(MOD(CALENDAR_MONTH, 3)=0, \"MANDATORY\", \"-\")","v":"MANDATORY"}]
["COREP_LR","COREP_4.0","IF(MOD(CALENDAR_MONTH, 3)=0, \"MANDATORY\", \"-\")",{"$f":"IF(MOD(CALENDAR_MONTH, 3)=0, \"MANDATORY\", \"-\")","v":"-"},{"$f":"IF(MOD(CALENDAR_MONTH, 3)=0, \"MANDATORY\", \"-\")","v":"-"},{"$f":"IF(MOD(CALENDAR_MONTH, 3)=0, \"MANDATORY\", \"-\")","v":"MANDATORY"},{"$f":"IF(MOD(CALENDAR_MONTH, 3)=0, \"MANDATORY\", \"-\")","v":"-"},{"$f":"IF(MOD(CALENDAR_MONTH, 3)=0, \"MANDATORY\", \"-\")","v":"-"},{"$f":"IF(MOD(CALENDAR_MONTH, 3)=0, \"MANDATORY\", \"-\")","v":"MANDATORY"},{"$f":"IF(MOD(CALENDAR_MONTH, 3)=0, \"MANDATORY\", \"-\")","v":"-"},{"$f":"IF(MOD(CALENDAR_MONTH, 3)=0, \"MANDATORY\", \"-\")","v":"-"},{"$f":"IF(MOD(CALENDAR_MONTH, 3)=0, \"MANDATORY\", \"-\")","v":"MANDATORY"},{"$f":"IF(MOD(CALENDAR_MONTH, 3)=0, \"MANDATORY\", \"-\")","v":"-"},{"$f":"IF(MOD(CALENDAR_MONTH, 3)=0, \"MANDATORY\", \"-\")","v":"-"},{"$f":"IF(MOD(CALENDAR_MONTH, 3)=0, \"MANDATORY\", \"-\")","v":"MANDATORY"}]
["COREP_NSFR","COREP_3.2","IF(MOD(CALENDAR_MONTH, 3)=0, IF(OR(TYPE=\"CONS_EU\", TYPE=\"SOLO_SUB\", TYPE=\"SOLO_SA\"), \"MANDATORY\", \"VOLUNTARY\"), \"-\")",{"$f":"IF(MOD(CALENDAR_MONTH, 3)=0, IF(OR(TYPE=\"CONS_EU\", TYPE=\"SOLO_SUB\", TYPE=\"SOLO_SA\"), \"MANDATORY\", \"VOLUNTARY\"), \"-\")","v":"-"},{"$f":"IF(MOD(CALENDAR_MONTH, 3)=0, IF(OR(TYPE=\"CONS_EU\", TYPE=\"SOLO_SUB\", TYPE=\"SOLO_SA\"), \"MANDATORY\", \"VOLUNTARY\"), \"-\")","v":"-"},{"$f":"IF(MOD(CALENDAR_MONTH, 3)=0, IF(OR(TYPE=\"CONS_EU\", TYPE=\"SOLO_SUB\", TYPE=\"SOLO_SA\"), \"MANDATORY\", \"VOLUNTARY\"), \"-\")","v":"MANDATORY"},{"$f":"IF(MOD(CALENDAR_MONTH, 3)=0, IF(OR(TYPE=\"CONS_EU\", TYPE=\"SOLO_SUB\", TYPE=\"SOLO_SA\"), \"MANDATORY\", \"VOLUNTARY\"), \"-\")","v":"-"},{"$f":"IF(MOD(CALENDAR_MONTH, 3)=0, IF(OR(TYPE=\"CONS_EU\", TYPE=\"SOLO_SUB\", TYPE=\"SOLO_SA\"), \"MANDATORY\", \"VOLUNTARY\"), \"-\")","v":"-"},{"$f":"IF(MOD(CALENDAR_MONTH, 3)=0, IF(OR(TYPE=\"CONS_EU\", TYPE=\"SOLO_SUB\", TYPE=\"SOLO_SA\"), \"MANDATORY\", \"VOLUNTARY\"), \"-\")","v":"MANDATORY"},{"$f":"IF(MOD(CALENDAR_MONTH, 3)=0, IF(OR(TYPE=\"CONS_EU\", TYPE=\"SOLO_SUB\", TYPE=\"SOLO_SA\"), \"MANDATORY\", \"VOLUNTARY\"), \"-\")","v":"-"},{"$f":"IF(MOD(CALENDAR_MONTH, 3)=0, IF(OR(TYPE=\"CONS_EU\", TYPE=\"SOLO_SUB\", TYPE=\"SOLO_SA\"), \"MANDATORY\", \"VOLUNTARY\"), \"-\")","v":"-"},{"$f":"IF(MOD(CALENDAR_MONTH, 3)=0, IF(OR(TYPE=\"CONS_EU\", TYPE=\"SOLO_SUB\", TYPE=\"SOLO_SA\"), \"MANDATORY\", \"VOLUNTARY\"), \"-\")","v":"MANDATORY"},{"$f":"IF(MOD(CALENDAR_MONTH, 3)=0, IF(OR(TYPE=\"CONS_EU\", TYPE=\"SOLO_SUB\", TYPE=\"SOLO_SA\"), \"MANDATORY\", \"VOLUNTARY\"), \"-\")","v":"-"},{"$f":"IF(MOD(CALENDAR_MONTH, 3)=0, IF(OR(TYPE=\"CONS_EU\", TYPE=\"SOLO_SUB\", TYPE=\"SOLO_SA\"), \"MANDATORY\", \"VOLUNTARY\"), \"-\")","v":"-"},{"$f":"IF(MOD(CALENDAR_MONTH, 3)=0, IF(OR(TYPE=\"CONS_EU\", TYPE=\"SOLO_SUB\", TYPE=\"SOLO_SA\"), \"MANDATORY\", \"VOLUNTARY\"), \"-\")","v":"MANDATORY"},{"$f":"IF(TYPE=\"SOLO_SUB\", \"For credit institutions waived from liquidity reporting at individual level pursuant to Article 8 CRR, the reporting obligation applies instead to the head of the liquidity subgroup, for the scope of the liquidity subgroup (Article 11(3) CRR).\", \"\")","v":""}]
["COREP_LCR_DA","COREP_3.2","IF(OR(TYPE=\"CONS_EU\", TYPE=\"SOLO_SUB\", TYPE=\"SOLO_SA\"), \"MANDATORY\", \"VOLUNTARY\")",{"$f":"IF(OR(TYPE=\"CONS_EU\", TYPE=\"SOLO_SUB\", TYPE=\"SOLO_SA\"), \"MANDATORY\", \"VOLUNTARY\")","v":"MANDATORY"},"MANDATORY","MANDATORY","MANDATORY","MANDATORY","MANDATORY","MANDATORY","MANDATORY","MANDATORY","MANDATORY","MANDATORY","MANDATORY",{"$f":"IF(TYPE=\"SOLO_SUB\", \"For credit institutions waived from liquidity reporting at individual level pursuant to Article 8 CRR, the reporting obligation applies instead to the head of the liquidity subgroup, for the scope of the liquidity subgroup (Article 11(3) CRR).\", \"\")","v":""}]
["COREP_ALM","COREP_3.2","IF(OR(TYPE=\"CONS_EU\", TYPE=\"SOLO_SUB\", TYPE=\"SOLO_SA\"), IF(OR(MOD(CALENDAR_MONTH, 3)=0, SNCI<>\"SMALL\"), \"MANDATORY\", \"NOT EXPECTED\"), \"VOLUNTARY\")",{"$f":"IF(OR(TYPE=\"CONS_EU\", TYPE=\"SOLO_SUB\", TYPE=\"SOLO_SA\"), IF(OR(MOD(CALENDAR_MONTH, 3)=0, SNCI<>\"SMALL\"), \"MANDATORY\", \"NOT EXPECTED\"), \"VOLUNTARY\")","v":"NOT EXPECTED"},{"$f":"IF(OR(TYPE=\"CONS_EU\", TYPE=\"SOLO_SUB\", TYPE=\"SOLO_SA\"), IF(OR(MOD(CALENDAR_MONTH, 3)=0, SNCI<>\"SMALL\"), \"MANDATORY\", \"NOT EXPECTED\"), \"VOLUNTARY\")","v":"NOT EXPECTED"},{"$f":"IF(OR(TYPE=\"CONS_EU\", TYPE=\"SOLO_SUB\", TYPE=\"SOLO_SA\"), IF(OR(MOD(CALENDAR_MONTH, 3)=0, SNCI<>\"SMALL\"), \"MANDATORY\", \"NOT EXPECTED\"), \"VOLUNTARY\")","v":"MANDATORY"},{"$f":"IF(OR(TYPE=\"CONS_EU\", TYPE=\"SOLO_SUB\", TYPE=\"SOLO_SA\"), IF(OR(MOD(CALENDAR_MONTH, 3)=0, SNCI<>\"SMALL\"), \"MANDATORY\", \"NOT EXPECTED\"), \"VOLUNTARY\")","v":"NOT EXPECTED"},{"$f":"IF(OR(TYPE=\"CONS_EU\", TYPE=\"SOLO_SUB\", TYPE=\"SOLO_SA\"), IF(OR(MOD(CALENDAR_MONTH, 3)=0, SNCI<>\"SMALL\"), \"MANDATORY\", \"NOT EXPECTED\"), \"VOLUNTARY\")","v":"NOT EXPECTED"},{"$f":"IF(OR(TYPE=\"CONS_EU\", TYPE=\"SOLO_SUB\", TYPE=\"SOLO_SA\"), IF(OR(MOD(CALENDAR_MONTH, 3)=0, SNCI<>\"SMALL\"), \"MANDATORY\", \"NOT EXPECTED\"), \"VOLUNTARY\")","v":"MANDATORY"},{"$f":"IF(OR(TYPE=\"CONS_EU\", TYPE=\"SOLO_SUB\", TYPE=\"SOLO_SA\"), IF(OR(MOD(CALENDAR_MONTH, 3)=0, SNCI<>\"SMALL\"), \"MANDATORY\", \"NOT EXPECTED\"), \"VOLUNTARY\")","v":"NOT EXPECTED"},{"$f":"IF(OR(TYPE=\"CONS_EU\", TYPE=\"SOLO_SUB\", TYPE=\"SOLO_SA\"), IF(OR(MOD(CALENDAR_MONTH, 3)=0, SNCI<>\"SMALL\"), \"MANDATORY\", \"NOT EXPECTED\"), \"VOLUNTARY\")","v":"NOT EXPECTED"},{"$f":"IF(OR(TYPE=\"CONS_EU\", TYPE=\"SOLO_SUB\", TYPE=\"SOLO_SA\"), IF(OR(MOD(CALENDAR_MONTH, 3)=0, SNCI<>\"SMALL\"), \"MANDATORY\", \"NOT EXPECTED\"), \"VOLUNTARY\")","v":"MANDATORY"},{"$f":"IF(OR(TYPE=\"CONS_EU\", TYPE=\"SOLO_SUB\", TYPE=\"SOLO_SA\"), IF(OR(MOD(CALENDAR_MONTH, 3)=0, SNCI<>\"SMALL\"), \"MANDATORY\", \"NOT EXPECTED\"), \"VOLUNTARY\")","v":"NOT EXPECTED"},{"$f":"IF(OR(TYPE=\"CONS_EU\", TYPE=\"SOLO_SUB\", TYPE=\"SOLO_SA\"), IF(OR(MOD(CALENDAR_MONTH, 3)=0, SNCI<>\"SMALL\"), \"MANDATORY\", \"NOT EXPECTED\"), \"VOLUNTARY\")","v":"NOT EXPECTED"},{"$f":"IF(OR(TYPE=\"CONS_EU\", TYPE=\"SOLO_SUB\", TYPE=\"SOLO_SA\"), IF(OR(MOD(CALENDAR_MONTH, 3)=0, SNCI<>\"SMALL\"), \"MANDATORY\", \"NOT EXPECTED\"), \"VOLUNTARY\")","v":"MANDATORY"},{"$f":"IF(TYPE=\"SOLO_SUB\", \"For credit institutions waived from liquidity reporting at individual level pursuant to Article 8 CRR, the reporting obligation applies instead to the head of the liquidity subgroup, for the scope of the liquidity subgroup (Article 11(3) CRR).\", \"\")","v":""}]
{"$rows_left_out":10}
{"sheet":"Templates","index":3,"n_rows":249,"n_cols":16,"rows_kept":249,"cut":false,"hidden":false,"merged":[[0,3,0,14]]}
[null,null,null,"Reporting obligations"]
["Module","Template","Reporting criteria","Jan","Feb","Mar","Apr","May","Jun","Jul","Aug","Sep","Oct","Nov","Dec","Additional information"]
["COREP_OF","C_00.01","MANDATORY",{"$f":"IF(TODAY(), IF(VLOOKUP(Templates!$A3,Modules!$A$3:$O$16,3+CALENDAR_MONTH,FALSE)=\"-\", \"-\", $C3), )","v":"-"},{"$f":"IF(TODAY(), IF(VLOOKUP(Templates!$A3,Modules!$A$3:$O$16,3+CALENDAR_MONTH,FALSE)=\"-\", \"-\", $C3), )","v":"-"},{"$f":"IF(TODAY(), IF(VLOOKUP(Templates!$A3,Modules!$A$3:$O$16,3+CALENDAR_MONTH,FALSE)=\"-\", \"-\", $C3), )","v":"MANDATORY"},{"$f":"IF(TODAY(), IF(VLOOKUP(Templates!$A3,Modules!$A$3:$O$16,3+CALENDAR_MONTH,FALSE)=\"-\", \"-\", $C3), )","v":"-"},{"$f":"IF(TODAY(), IF(VLOOKUP(Templates!$A3,Modules!$A$3:$O$16,3+CALENDAR_MONTH,FALSE)=\"-\", \"-\", $C3), )","v":"-"},{"$f":"IF(TODAY(), IF(VLOOKUP(Templates!$A3,Modules!$A$3:$O$16,3+CALENDAR_MONTH,FALSE)=\"-\", \"-\", $C3), )","v":"MANDATORY"},{"$f":"IF(TODAY(), IF(VLOOKUP(Templates!$A3,Modules!$A$3:$O$16,3+CALENDAR_MONTH,FALSE)=\"-\", \"-\", $C3), )","v":"-"},{"$f":"IF(TODAY(), IF(VLOOKUP(Templates!$A3,Modules!$A$3:$O$16,3+CALENDAR_MONTH,FALSE)=\"-\", \"-\", $C3), )","v":"-"},{"$f":"IF(TODAY(), IF(VLOOKUP(Templates!$A3,Modules!$A$3:$O$16,3+CALENDAR_MONTH,FALSE)=\"-\", \"-\", $C3), )","v":"MANDATORY"},{"$f":"IF(TODAY(), IF(VLOOKUP(Templates!$A3,Modules!$A$3:$O$16,3+CALENDAR_MONTH,FALSE)=\"-\", \"-\", $C3), )","v":"-"},{"$f":"IF(TODAY(), IF(VLOOKUP(Templates!$A3,Modules!$A$3:$O$16,3+CALENDAR_MONTH,FALSE)=\"-\", \"-\", $C3), )","v":"-"},{"$f":"IF(TODAY(), IF(VLOOKUP(Templates!$A3,Modules!$A$3:$O$16,3+CALENDAR_MONTH,FALSE)=\"-\", \"-\", $C3), )","v":"MANDATORY"}]
["COREP_OF","C_01.00","MANDATORY",{"$f":"IF(TODAY(), IF(VLOOKUP(Templates!$A4,Modules!$A$3:$O$16,3+CALENDAR_MONTH,FALSE)=\"-\", \"-\", $C4), )","v":"-"},{"$f":"IF(TODAY(), IF(VLOOKUP(Templates!$A4,Modules!$A$3:$O$16,3+CALENDAR_MONTH,FALSE)=\"-\", \"-\", $C4), )","v":"-"},{"$f":"IF(TODAY(), IF(VLOOKUP(Templates!$A4,Modules!$A$3:$O$16,3+CALENDAR_MONTH,FALSE)=\"-\", \"-\", $C4), )","v":"MANDATORY"},{"$f":"IF(TODAY(), IF(VLOOKUP(Templates!$A4,Modules!$A$3:$O$16,3+CALENDAR_MONTH,FALSE)=\"-\", \"-\", $C4), )","v":"-"},{"$f":"IF(TODAY(), IF(VLOOKUP(Templates!$A4,Modules!$A$3:$O$16,3+CALENDAR_MONTH,FALSE)=\"-\", \"-\", $C4), )","v":"-"},{"$f":"IF(TODAY(), IF(VLOOKUP(Templates!$A4,Modules!$A$3:$O$16,3+CALENDAR_MONTH,FALSE)=\"-\", \"-\", $C4), )","v":"MANDATORY"},{"$f":"IF(TODAY(), IF(VLOOKUP(Templates!$A4,Modules!$A$3:$O$16,3+CALENDAR_MONTH,FALSE)=\"-\", \"-\", $C4), )","v":"-"},{"$f":"IF(TODAY(), IF(VLOOKUP(Templates!$A4,Modules!$A$3:$O$16,3+CALENDAR_MONTH,FALSE)=\"-\", \"-\", $C4), )","v":"-"},{"$f":"IF(TODAY(), IF(VLOOKUP(Templates!$A4,Modules!$A$3:$O$16,3+CALENDAR_MONTH,FALSE)=\"-\", \"-\", $C4), )","v":"MANDATORY"},{"$f":"IF(TODAY(), IF(VLOOKUP(Templates!$A4,Modules!$A$3:$O$16,3+CALENDAR_MONTH,FALSE)=\"-\", \"-\", $C4), )","v":"-"},{"$f":"IF(TODAY(), IF(VLOOKUP(Templates!$A4,Modules!$A$3:$O$16,3+CALENDAR_MONTH,FALSE)=\"-\", \"-\", $C4), )","v":"-"},{"$f":"IF(TODAY(), IF(VLOOKUP(Templates!$A4,Modules!$A$3:$O$16,3+CALENDAR_MONTH,FALSE)=\"-\", \"-\", $C4), )","v":"MANDATORY"}]
["COREP_OF","C_02.00","MANDATORY",{"$f":"IF(TODAY(), IF(VLOOKUP(Templates!$A5,Modules!$A$3:$O$16,3+CALENDAR_MONTH,FALSE)=\"-\", \"-\", $C5), )","v":"-"},{"$f":"IF(TODAY(), IF(VLOOKUP(Templates!$A5,Modules!$A$3:$O$16,3+CALENDAR_MONTH,FALSE)=\"-\", \"-\", $C5), )","v":"-"},{"$f":"IF(TODAY(), IF(VLOOKUP(Templates!$A5,Modules!$A$3:$O$16,3+CALENDAR_MONTH,FALSE)=\"-\", \"-\", $C5), )","v":"MANDATORY"},{"$f":"IF(TODAY(), IF(VLOOKUP(Templates!$A5,Modules!$A$3:$O$16,3+CALENDAR_MONTH,FALSE)=\"-\", \"-\", $C5), )","v":"-"},{"$f":"IF(TODAY(), IF(VLOOKUP(Templates!$A5,Modules!$A$3:$O$16,3+CALENDAR_MONTH,FALSE)=\"-\", \"-\", $C5), )","v":"-"},{"$f":"IF(TODAY(), IF(VLOOKUP(Templates!$A5,Modules!$A$3:$O$16,3+CALENDAR_MONTH,FALSE)=\"-\", \"-\", $C5), )","v":"MANDATORY"},{"$f":"IF(TODAY(), IF(VLOOKUP(Templates!$A5,Modules!$A$3:$O$16,3+CALENDAR_MONTH,FALSE)=\"-\", \"-\", $C5), )","v":"-"},{"$f":"IF(TODAY(), IF(VLOOKUP(Templates!$A5,Modules!$A$3:$O$16,3+CALENDAR_MONTH,FALSE)=\"-\", \"-\", $C5), )","v":"-"},{"$f":"IF(TODAY(), IF(VLOOKUP(Templates!$A5,Modules!$A$3:$O$16,3+CALENDAR_MONTH,FALSE)=\"-\", \"-\", $C5), )","v":"MANDATORY"},{"$f":"IF(TODAY(), IF(VLOOKUP(Templates!$A5,Modules!$A$3:$O$16,3+CALENDAR_MONTH,FALSE)=\"-\", \"-\", $C5), )","v":"-"},{"$f":"IF(TODAY(), IF(VLOOKUP(Templates!$A5,Modules!$A$3:$O$16,3+CALENDAR_MONTH,FALSE)=\"-\", \"-\", $C5), )","v":"-"},{"$f":"IF(TODAY(), IF(VLOOKUP(Templates!$A5,Modules!$A$3:$O$16,3+CALENDAR_MONTH,FALSE)=\"-\", \"-\", $C5), )","v":"MANDATORY"}]
["COREP_OF","C_03.00","MANDATORY",{"$f":"IF(TODAY(), IF(VLOOKUP(Templates!$A6,Modules!$A$3:$O$16,3+CALENDAR_MONTH,FALSE)=\"-\", \"-\", $C6), )","v":"-"},{"$f":"IF(TODAY(), IF(VLOOKUP(Templates!$A6,Modules!$A$3:$O$16,3+CALENDAR_MONTH,FALSE)=\"-\", \"-\", $C6), )","v":"-"},{"$f":"IF(TODAY(), IF(VLOOKUP(Templates!$A6,Modules!$A$3:$O$16,3+CALENDAR_MONTH,FALSE)=\"-\", \"-\", $C6), )","v":"MANDATORY"},{"$f":"IF(TODAY(), IF(VLOOKUP(Templates!$A6,Modules!$A$3:$O$16,3+CALENDAR_MONTH,FALSE)=\"-\", \"-\", $C6), )","v":"-"},{"$f":"IF(TODAY(), IF(VLOOKUP(Templates!$A6,Modules!$A$3:$O$16,3+CALENDAR_MONTH,FALSE)=\"-\", \"-\", $C6), )","v":"-"},{"$f":"IF(TODAY(), IF(VLOOKUP(Templates!$A6,Modules!$A$3:$O$16,3+CALENDAR_MONTH,FALSE)=\"-\", \"-\", $C6), )","v":"MANDATORY"},{"$f":"IF(TODAY(), IF(VLOOKUP(Templates!$A6,Modules!$A$3:$O$16,3+CALENDAR_MONTH,FALSE)=\"-\", \"-\", $C6), )","v":"-"},{"$f":"IF(TODAY(), IF(VLOOKUP(Templates!$A6,Modules!$A$3:$O$16,3+CALENDAR_MONTH,FALSE)=\"-\", \"-\", $C6), )","v":"-"},{"$f":"IF(TODAY(), IF(VLOOKUP(Templates!$A6,Modules!$A$3:$O$16,3+CALENDAR_MONTH,FALSE)=\"-\", \"-\", $C6), )","v":"MANDATORY"},{"$f":"IF(TODAY(), IF(VLOOKUP(Templates!$A6,Modules!$A$3:$O$16,3+CALENDAR_MONTH,FALSE)=\"-\", \"-\", $C6), )","v":"-"},{"$f":"IF(TODAY(), IF(VLOOKUP(Templates!$A6,Modules!$A$3:$O$16,3+CALENDAR_MONTH,FALSE)=\"-\", \"-\", $C6), )","v":"-"},{"$f":"IF(TODAY(), IF(VLOOKUP(Templates!$A6,Modules!$A$3:$O$16,3+CALENDAR_MONTH,FALSE)=\"-\", \"-\", $C6), )","v":"MANDATORY"}]
["COREP_OF","C_04.00","MANDATORY",{"$f":"IF(TODAY(), IF(VLOOKUP(Templates!$A7,Modules!$A$3:$O$16,3+CALENDAR_MONTH,FALSE)=\"-\", \"-\", $C7), )","v":"-"},{"$f":"IF(TODAY(), IF(VLOOKUP(Templates!$A7,Modules!$A$3:$O$16,3+CALENDAR_MONTH,FALSE)=\"-\", \"-\", $C7), )","v":"-"},{"$f":"IF(TODAY(), IF(VLOOKUP(Templates!$A7,Modules!$A$3:$O$16,3+CALENDAR_MONTH,FALSE)=\"-\", \"-\", $C7), )","v":"MANDATORY"},{"$f":"IF(TODAY(), IF(VLOOKUP(Templates!$A7,Modules!$A$3:$O$16,3+CALENDAR_MONTH,FALSE)=\"-\", \"-\", $C7), )","v":"-"},{"$f":"IF(TODAY(), IF(VLOOKUP(Templates!$A7,Modules!$A$3:$O$16,3+CALENDAR_MONTH,FALSE)=\"-\", \"-\", $C7), )","v":"-"},{"$f":"IF(TODAY(), IF(VLOOKUP(Templates!$A7,Modules!$A$3:$O$16,3+CALENDAR_MONTH,FALSE)=\"-\", \"-\", $C7), )","v":"MANDATORY"},{"$f":"IF(TODAY(), IF(VLOOKUP(Templates!$A7,Modules!$A$3:$O$16,3+CALENDAR_MONTH,FALSE)=\"-\", \"-\", $C7), )","v":"-"},{"$f":"IF(TODAY(), IF(VLOOKUP(Templates!$A7,Modules!$A$3:$O$16,3+CALENDAR_MONTH,FALSE)=\"-\", \"-\", $C7), )","v":"-"},{"$f":"IF(TODAY(), IF(VLOOKUP(Templates!$A7,Modules!$A$3:$O$16,3+CALENDAR_MONTH,FALSE)=\"-\", \"-\", $C7), )","v":"MANDATORY"},{"$f":"IF(TODAY(), IF(VLOOKUP(Templates!$A7,Modules!$A$3:$O$16,3+CALENDAR_MONTH,FALSE)=\"-\", \"-\", $C7), )","v":"-"},{"$f":"IF(TODAY(), IF(VLOOKUP(Templates!$A7,Modules!$A$3:$O$16,3+CALENDAR_MONTH,FALSE)=\"-\", \"-\", $C7), )","v":"-"},{"$f":"IF(TODAY(), IF(VLOOKUP(Templates!$A7,Modules!$A$3:$O$16,3+CALENDAR_MONTH,FALSE)=\"-\", \"-\", $C7), )","v":"MANDATORY"}]
["COREP_OF","C_05.01","MANDATORY",{"$f":"IF(TODAY(), IF(VLOOKUP(Templates!$A8,Modules!$A$3:$O$16,3+CALENDAR_MONTH,FALSE)=\"-\", \"-\", $C8), )","v":"-"},{"$f":"IF(TODAY(), IF(VLOOKUP(Templates!$A8,Modules!$A$3:$O$16,3+CALENDAR_MONTH,FALSE)=\"-\", \"-\", $C8), )","v":"-"},{"$f":"IF(TODAY(), IF(VLOOKUP(Templates!$A8,Modules!$A$3:$O$16,3+CALENDAR_MONTH,FALSE)=\"-\", \"-\", $C8), )","v":"MANDATORY"},{"$f":"IF(TODAY(), IF(VLOOKUP(Templates!$A8,Modules!$A$3:$O$16,3+CALENDAR_MONTH,FALSE)=\"-\", \"-\", $C8), )","v":"-"},{"$f":"IF(TODAY(), IF(VLOOKUP(Templates!$A8,Modules!$A$3:$O$16,3+CALENDAR_MONTH,FALSE)=\"-\", \"-\", $C8), )","v":"-"},{"$f":"IF(TODAY(), IF(VLOOKUP(Templates!$A8,Modules!$A$3:$O$16,3+CALENDAR_MONTH,FALSE)=\"-\", \"-\", $C8), )","v":"MANDATORY"},{"$f":"IF(TODAY(), IF(VLOOKUP(Templates!$A8,Modules!$A$3:$O$16,3+CALENDAR_MONTH,FALSE)=\"-\", \"-\", $C8), )","v":"-"},{"$f":"IF(TODAY(), IF(VLOOKUP(Templates!$A8,Modules!$A$3:$O$16,3+CALENDAR_MONTH,FALSE)=\"-\", \"-\", $C8), )","v":"-"},{"$f":"IF(TODAY(), IF(VLOOKUP(Templates!$A8,Modules!$A$3:$O$16,3+CALENDAR_MONTH,FALSE)=\"-\", \"-\", $C8), )","v":"MANDATORY"},{"$f":"IF(TODAY(), IF(VLOOKUP(Templates!$A8,Modules!$A$3:$O$16,3+CALENDAR_MONTH,FALSE)=\"-\", \"-\", $C8), )","v":"-"},{"$f":"IF(TODAY(), IF(VLOOKUP(Templates!$A8,Modules!$A$3:$O$16,3+CALENDAR_MONTH,FALSE)=\"-\", \"-\", $C8), )","v":"-"},{"$f":"IF(TODAY(), IF(VLOOKUP(Templates!$A8,Modules!$A$3:$O$16,3+CALENDAR_MONTH,FALSE)=\"-\", \"-\", $C8), )","v":"MANDATORY"},"This template is Activity-based, therefore further conditions apply."]
{"$rows_left_out":242}
{"sheet":"Changes July 2023","index":4,"n_rows":30,"n_cols":4,"rows_kept":30,"cut":false,"hidden":false,"merged":[]}
[]
["Module","Template","Before the update","New adaptions "]
["COREP_OF","C_08.05","IF(CREDRISK_IRB=\"Y\", IF(CALENDAR_MONTH<>0, \"NOT EXPECTED\", IF(LARGE_OR_REGULAR_LISTED, \"MANDATORY\", \"VOLUNTARY\")), \"NOT EXPECTED\")","IF(CREDRISK_IRB=\"Y\", IF(CALENDAR_MONTH<>12, \"NOT EXPECTED\", IF(AND(LARGE_OR_REGULAR_LISTED, CALENDAR_MONTH = 12), \"MANDATORY\", \"VOLUNTARY\")), \"NOT EXPECTED\")), )"]
["COREP_OF","C_08.07","IF(CREDRISK_IRB=\"Y\", IF(CALENDAR_MONTH<>0, \"NOT EXPECTED\", IF(LARGE_OR_REGULAR_LISTED, \"MANDATORY\", \"VOLUNTARY\")), \"NOT EXPECTED\")","IF(CREDRISK_IRB=\"Y\", IF(CALENDAR_MONTH<>12, \"NOT EXPECTED\", IF(AND(LARGE_OR_REGULAR_LISTED, CALENDAR_MONTH = 12), \"MANDATORY\", \"VOLUNTARY\")), \"NOT EXPECTED\")), )"]
["COREP_NSFR","C_80.00","IF(AND(SNCI<>\"SMALL\", NSFR_METHODOLOGY<>\"SIMPLIFIED\"), \"MANDATORY\", \"NOT EXPECTED\")","IF(AND(SNCI=\"SMALL\", NSFR_METHODOLOGY=\"SIMPLIFIED\"),  \"NOT EXPECTED\", \"MANDATORY\")"]
["COREP_NSFR","C_81.00","IF(AND(SNCI<>\"SMALL\", NSFR_METHODOLOGY<>\"SIMPLIFIED\"), \"MANDATORY\", \"NOT EXPECTED\")","IF(AND(SNCI=\"SMALL\", NSFR_METHODOLOGY=\"SIMPLIFIED\"),  \"NOT EXPECTED\", \"MANDATORY\")"]
["COREP_NSFR","C_82.00","IF(AND(SNCI=\"SMALL\", NSFR_METHODOLOGY=\"SIMPLIFIED\"), \"MANDATORY\", \"NOT EXPECTED\")","IF(AND(SNCI=\"SMALL\",NSFR_METHODOLOGY=\"SIMPLIFIED\"),\"MANDATORY\",\"NOT EXPECTED\")))"]
["COREP_ALM","C_68.00","IF(SNCI<>\"SMALL\", \"MANDATORY\", \"VOLUNTARY\")","IF(SNCI<>\"SMALL\", \"MANDATORY\", \"NOT EXPECTED\")"]
{"$rows_left_out":23}
{"sheet":"Changes October 2025","index":5,"n_rows":61,"n_cols":4,"rows_kept":61,"cut":false,"hidden":false,"merged":[]}
[]
["Module","Template","Before the update","New adaptions "]
["IRRBB",null,"-","IRRBB_3.4"]
["IRRBB",null,"-","IF(MOD(CALENDAR_MONTH, 3)=0, \"MANDATORY\", \"-\")"]
["IRRBB","J_01.00","-","MANDATORY"]
["IRRBB","J_02.00","-","IF(SNCI=\"LARGE\", \"MANDATORY\", \"NOT EXPECTED\")"]
["IRRBB","J_03.00","-","IF(SNCI=\"REGULAR\", \"MANDATORY\", \"NOT EXPECTED\")"]
["IRRBB","J_04.00","-","IF(SNCI=\"SMALL\", \"MANDATORY\", \"NOT EXPECTED\")"]
{"$rows_left_out":54}
{"sheet":"Versioning information","index":6,"n_rows":13,"n_cols":5,"rows_kept":13,"cut":false,"hidden":true,"merged":[[1,3,1,4],[3,1,3,4],[4,1,4,4]]}
[]
[null,null,null,"With thanks to the contribution of the Competent Authorities of the European Union and the EEA to this tool, \nand in particular to the Single Supervisory Mechanism"]
[]
[null,"SIGNPOSTING TOOL"]
[null,"Credit institution's reporting obligations\nin accordance with Regulation (EU) No 575/2013 (CRR) and Directive 2013/36/EU (CRD)"]
[]
[null,"Version","Publication date","Based on EBA reporting framework release","Version information"]
[null,"0.1.0",null,"v3.2","latest draft 30/10/2022"]
{"$rows_left_out":6}
{"sheet":"Glossary","index":7,"n_rows":4,"n_cols":2,"rows_kept":4,"cut":false,"hidden":true,"merged":[]}
[]
[null,"EBA reporting framework"]
[null,"Framwork (conceptual)"]
[null,"Module"]